Target
Aldo-keto reductase family 1 member B1
Ligand
BDBM50009844
Substrate
Meas. Tech.
ChEMBL_32093 (CHEMBL644296)
IC50
300±n/a nM
Citation
 Mylari, BLBeyer, TASiegel, TW A highly specific aldose reductase inhibitor, ethyl 1-benzyl-3-hydroxy-2(5H)-oxopyrrole-4-carboxylate, and its congeners. J Med Chem 34:1011-8 (1991)  
Target
Name:
Aldo-keto reductase family 1 member B1
Synonyms:
ALDR_RAT Akr1b4 Aldr1
Type:
PROTEIN
Mol. Mass.:
35797.87
Organism:
Rattus norvegicus
Description:
ChEMBL_1512484
Residue:
316
  
Inhibitor
Name:
BDBM50009844
Synonyms:
2-fluorospiro[9H-fluorene-9,4'-(tetrahydro-1'H-imidazole)]-2',5'-dione | CHEMBL7480
Type:
Small organic molecule
Emp. Form.:
C15H9FN2O2
Mol. Mass.:
268.2426
SMILES:
Fc1ccc2-c3ccccc3C3(NC(=O)NC3=O)c2c1
: