Target
Aldo-keto reductase family 1 member B1
Ligand
BDBM50009849
Substrate
Meas. Tech.
ChEMBL_31772 (CHEMBL643099)
IC50
310±n/a nM
Citation
 Mylari, BLBeyer, TASiegel, TW A highly specific aldose reductase inhibitor, ethyl 1-benzyl-3-hydroxy-2(5H)-oxopyrrole-4-carboxylate, and its congeners. J Med Chem 34:1011-8 (1991)  
Target
Name:
Aldo-keto reductase family 1 member B1
Synonyms:
AKR1B1 ALDR_HUMAN AR Aldose Reductase (ALR2) Aldose reductase (AR)
Type:
Protein
Mol. Mass.:
35855.50
Organism:
Homo sapiens (Human)
Description:
P15121. 4LAU; 2IKI; 4LB4; 2FZD; 2FZ8; 1US0
Residue:
316
  
Inhibitor
Name:
BDBM50009849
Synonyms:
1-(4-Chloro-benzyl)-4-hydroxy-5-oxo-2,5-dihydro-1H-pyrrole-3-carboxylic acid ethyl ester | CHEMBL7183
Type:
Small organic molecule
Emp. Form.:
C14H14ClNO4
Mol. Mass.:
295.718
SMILES:
CCOC(=O)C1CN(Cc2ccc(Cl)cc2)C(=O)C1=O
: