Target
Adenosine receptor A1
Ligand
BDBM50453036
Substrate
Meas. Tech.
ChEBML_29172
Ki
2580±n/a nM
Citation
 Trivedi, BKBlankley, CJBristol, JAHamilton, HWPatt, WCKramer, WJJohnson, SABruns, RFCohen, DMRyan, MJ N6-substituted adenosine receptor agonists: potential antihypertensive agents. J Med Chem 34:1043-9 (1991)  
Target
Name:
Adenosine receptor A1
Synonyms:
AA1R_RAT ADENOSINE A1 high Adenosine A1 receptor (A1) Adenosine receptors A1 | Adora1
Type:
Protein
Mol. Mass.:
36704.13
Organism:
Rattus norvegicus (rat)
Description:
Residue:
326
  
Inhibitor
Name:
BDBM50453036
Synonyms:
CHEMBL2092768
Type:
Small organic molecule
Emp. Form.:
C21H25N5O5
Mol. Mass.:
427.4537
SMILES:
COc1ccc2CCCC(Nc3ncnc4n(cnc34)[C@@H]3O[C@H](CO)[C@@H](O)[C@H]3O)c2c1
: