Target
Adenosine receptor A1
Ligand
BDBM50453038
Substrate
Meas. Tech.
ChEMBL_29172 (CHEMBL637903)
Ki
236±n/a nM
Citation
 Trivedi, BKBlankley, CJBristol, JAHamilton, HWPatt, WCKramer, WJJohnson, SABruns, RFCohen, DMRyan, MJ N6-substituted adenosine receptor agonists: potential antihypertensive agents. J Med Chem 34:1043-9 (1991)  
Target
Name:
Adenosine receptor A1
Synonyms:
AA1R_RAT ADENOSINE A1 high Adenosine A1 receptor (A1) Adenosine receptors A1 | Adora1
Type:
Protein
Mol. Mass.:
36704.13
Organism:
Rattus norvegicus (rat)
Description:
Residue:
326
  
Inhibitor
Name:
BDBM50453038
Synonyms:
CHEMBL2092765
Type:
Small organic molecule
Emp. Form.:
C20H23N5O5
Mol. Mass.:
413.4271
SMILES:
COc1ccc2C(CCc2c1)Nc1ncnc2n(cnc12)[C@@H]1O[C@H](CO)[C@@H](O)[C@H]1O
: