Target
Adenosine receptor A2a/A2b
Ligand
BDBM50368207
Substrate
Meas. Tech.
ChEMBL_30710 (CHEMBL645453)
Ki
44±n/a nM
Citation
 Trivedi, BKBlankley, CJBristol, JAHamilton, HWPatt, WCKramer, WJJohnson, SABruns, RFCohen, DMRyan, MJ N6-substituted adenosine receptor agonists: potential antihypertensive agents. J Med Chem 34:1043-9 (1991)  
Target
Name:
Adenosine receptor A2a/A2b
Synonyms:
Adenosine A2 receptor
Type:
Mol. Mass.:
Description:
ASSAY_ID of ChEMBL is 30560
Components:
This complex has 2 components.
Component 1
Name:
Adenosine receptor A2b
Synonyms:
AA2BR_RAT Adora2b
Type:
PROTEIN
Mol. Mass.:
36378.84
Organism:
Rattus norvegicus
Description:
ChEMBL_32934
Residue:
332
  
Component 2
Name:
Adenosine receptor A2a
Synonyms:
AA2AR_RAT Adenosine A2 receptor Adenosine Receptors A2a (A2a) Adenosine receptors A2a Rat striatal adenosine A2a receptor
Type:
G Protein-Coupled Receptor (GPCR)
Mol. Mass.:
45015.65
Organism:
Rattus norvegicus (rat)
Description:
Rat A2A receptors expressed in CHO cells.
Residue:
410
  
Inhibitor
Name:
BDBM50368207
Synonyms:
CHEMBL605165
Type:
Small organic molecule
Emp. Form.:
C20H21N5O4
Mol. Mass.:
395.4118
SMILES:
OC[C@H]1OC([C@H](O)[C@@H]1O)n1cnc2c(NCC3=CCc4ccccc34)ncnc12
: