Target
D(2) dopamine receptor
Ligand
BDBM50007479
Substrate
Meas. Tech.
ChEMBL_58709 (CHEMBL669055)
IC50
>20000±n/a nM
Citation
 Hrib, NJJurcak, JGHuger, FPErrico, CLDunn, RW Synthesis and biological evaluation of a series of substituted N-alkoxyimides and -amides as potential atypical antipsychotic agents. J Med Chem 34:1068-72 (1991)  
Target
Name:
D(2) dopamine receptor
Synonyms:
DOPAMINE D2 DOPAMINE D2 Short Dopamine D2 receptor Drd2
Type:
G Protein-Coupled Receptor (GPCR)
Mol. Mass.:
50931.60
Organism:
Rattus norvegicus (rat)
Description:
P61169
Residue:
444
  
Inhibitor
Name:
BDBM50007479
Synonyms:
2-{3-[4-(3-Methylsulfanyl-phenyl)-piperazin-1-yl]-propoxy}-isoindole-1,3-dione | CHEMBL10194
Type:
Small organic molecule
Emp. Form.:
C22H25N3O3S
Mol. Mass.:
411.517
SMILES:
CSc1cccc(c1)N1CCN(CCCON2C(=O)c3ccccc3C2=O)CC1
: