Target
5-hydroxytryptamine receptor 1A
Ligand
BDBM50007494
Substrate
Meas. Tech.
ChEBML_847
IC50
40±n/a nM
Citation
 Hrib, NJJurcak, JGHuger, FPErrico, CLDunn, RW Synthesis and biological evaluation of a series of substituted N-alkoxyimides and -amides as potential atypical antipsychotic agents. J Med Chem 34:1068-72 (1991)  
Target
Name:
5-hydroxytryptamine receptor 1A
Synonyms:
5-HT-1A 5-HT1A 5-hydroxytryptamine receptor 1A (5HT1A) 5ht1a Htr1a Serotonin 1a (5-HT1a) receptor/Adrenergic receptor alpha-1 | Serotonin receptor 1A
Type:
G Protein-Coupled Receptor (GPCR)
Mol. Mass.:
46445.29
Organism:
Rattus norvegicus (rat)
Description:
Binding assays were performed using rat hippocampal membranes.
Residue:
422
  
Inhibitor
Name:
BDBM50007494
Synonyms:
8-{3-[4-(3-Chloro-phenyl)-piperazin-1-yl]-propoxy}-8-aza-spiro[4.5]decane-7,9-dione(HCl0.5H2O) | CHEMBL10821
Type:
Small organic molecule
Emp. Form.:
C22H30ClN3O3
Mol. Mass.:
419.945
SMILES:
Clc1cccc(c1)N1CCN(CCCON2C(=O)CC3(CCCC3)CC2=O)CC1
: