Target
Sigma non-opioid intracellular receptor 1
Ligand
BDBM50041245
Substrate
Meas. Tech.
ChEBML_201295
Ki
4.8±n/a nM
Citation
 Glennon, RASmith, JDIsmaiel, AMel-Ashmawy, MBattaglia, GFischer, JB Identification and exploitation of the sigma-opiate pharmacophore. J Med Chem 34:1094-8 (1991)  
Target
Name:
Sigma non-opioid intracellular receptor 1
Synonyms:
Opioid receptor SGMR1_RAT Sigma non-opioid intracellular receptor 1 Sigma-1 | Sigmar1
Type:
Enzyme Catalytic Domain
Mol. Mass.:
25266.54
Organism:
RAT
Description:
Q9R0C9
Residue:
223
  
Inhibitor
Name:
BDBM50041245
Synonyms:
((S)-1-Methyl-2-phenyl-ethyl)-phenethyl-amine | CHEMBL20804
Type:
Small organic molecule
Emp. Form.:
C17H21N
Mol. Mass.:
239.3553
SMILES:
C[C@@H](Cc1ccccc1)NCCc1ccccc1
: