Target
Adenosine deaminase
Ligand
BDBM50011590
Substrate
Meas. Tech.
ChEBML_30806
Ki
930±n/a nM
Citation
 Cristalli, GEleuteri, AFranchetti, PGrifantini, MVittori, SLupidi, G Adenosine deaminase inhibitors: synthesis and structure-activity relationships of imidazole analogues of erythro-9-(2-hydroxy-3-nonyl)adenine. J Med Chem 34:1187-92 (1991)  
Target
Name:
Adenosine deaminase
Synonyms:
ADA Adenosine aminohydrolase
Type:
Enzyme
Mol. Mass.:
40910.44
Organism:
Bos taurus (bovine)
Description:
Residue:
363
  
Inhibitor
Name:
BDBM50011590
Synonyms:
1-[1-(1-Hydroxy-ethyl)-heptyl]-1H-imidazole-4-carboxylic acid (2-hydroxy-ethyl)-amide | CHEMBL18188
Type:
Small organic molecule
Emp. Form.:
C15H27N3O3
Mol. Mass.:
297.3932
SMILES:
CCCCCCC(C(C)O)n1cnc(c1)C(=O)NCCO
: