Target
Adenosine deaminase
Ligand
BDBM50011565
Substrate
Meas. Tech.
ChEBML_30806
Ki
71000±n/a nM
Citation
 Cristalli, GEleuteri, AFranchetti, PGrifantini, MVittori, SLupidi, G Adenosine deaminase inhibitors: synthesis and structure-activity relationships of imidazole analogues of erythro-9-(2-hydroxy-3-nonyl)adenine. J Med Chem 34:1187-92 (1991)  
Target
Name:
Adenosine deaminase
Synonyms:
ADA Adenosine aminohydrolase
Type:
Enzyme
Mol. Mass.:
40910.44
Organism:
Bos taurus (bovine)
Description:
Residue:
363
  
Inhibitor
Name:
BDBM50011565
Synonyms:
3-(4-Amino-benzoimidazol-1-yl)-nonan-2-ol | CHEMBL17822
Type:
Small organic molecule
Emp. Form.:
C16H25N3O
Mol. Mass.:
275.3892
SMILES:
CCCCCCC(C(C)O)n1cnc2c(N)cccc12
: