Target
Mu-type opioid receptor
Ligand
BDBM50009137
Substrate
Meas. Tech.
ChEBML_149005
Ki
10571±n/a nM
Citation
 Lazarus, LHSalvadori, SSantagada, VTomatis, RWilson, WE Function of negative charge in the"address domain" of deltorphins. J Med Chem 34:1350-5 (1991)  
Target
Name:
Mu-type opioid receptor
Synonyms:
MOR-1 Mu-type opioid receptor (MOR) OPRM_RAT Opioid receptor B Ror-b
Type:
G Protein-Coupled Receptor (GPCR)
Mol. Mass.:
44503.11
Organism:
Rattus norvegicus (rat)
Description:
Competition binding assays were carried out using membrane preparations from transfected HN9.10 cells that constitutively expressed the mu opioid receptor.
Residue:
398
  
Inhibitor
Name:
BDBM50009137
Synonyms:
3-(2-{2-[2-Amino-3-(4-hydroxy-phenyl)-propionylamino]-4-methylsulfanyl-butyrylamino}-3-phenyl-propionylamino)-N-{1-[1-(1-carbamoyl-2-carboxy-ethylcarbamoyl)-3-methylsulfanyl-propylcarbamoyl]-3-methyl-butyl}-succinamic acid | CHEMBL282181
Type:
Small organic molecule
Emp. Form.:
C42H60N8O12S2
Mol. Mass.:
933.102
SMILES:
CSCC[C@@H](NC(=O)[C@@H](N)Cc1ccc(O)cc1)C(=O)N[C@@H](Cc1ccccc1)C(=O)N[C@@H](CC(O)=O)C(=O)N[C@@H](CC(C)C)C(=O)N[C@@H](CCSC)C(=O)N[C@@H](CC(O)=O)C(N)=O
: