Target
Acyl-protein thioesterase 1
Ligand
BDBM50011905
Substrate
Meas. Tech.
ChEBML_100183
IC50
88000±n/a nM
Citation
 Mingeot-Leclercq, MPVan Schepdael, ABrasseur, RBusson, RVanderhaeghe, HJClaes, PJTulkens, PM New derivatives of kanamycin B obtained by modifications and substitutions in position 6''. 2. In vitro and computer-aided toxicological evaluation with respect to interactions with phosphatidylinositol. J Med Chem 34:1476-82 (1991)  
Target
Name:
Acyl-protein thioesterase 1
Synonyms:
Acyl-protein thioesterase 1/2 LYPA1_RAT Lysosomal phospholipase A1
Type:
PROTEIN
Mol. Mass.:
24708.49
Organism:
Rattus norvegicus
Description:
ChEMBL_12731
Residue:
230
  
Inhibitor
Name:
BDBM50011905
Synonyms:
CHEMBL285200 | N-{4-Amino-6-[4,6-diamino-3-(3-amino-6-aminomethyl-4,5-dihydroxy-tetrahydro-pyran-2-yloxy)-2-hydroxy-cyclohexyloxy]-3,5-dihydroxy-tetrahydro-pyran-2-ylmethyl}-butyramide
Type:
Small organic molecule
Emp. Form.:
C22H44N6O10
Mol. Mass.:
552.619
SMILES:
CCCC(=O)NCC1OC(OC2C(N)CC(N)C(OC3OC(CN)C(O)C(O)C3N)C2O)C(O)C(N)C1O
: