Target
Acyl-protein thioesterase 1
Ligand
BDBM50011914
Substrate
Meas. Tech.
ChEBML_100183
IC50
78000±n/a nM
Citation
 Mingeot-Leclercq, MPVan Schepdael, ABrasseur, RBusson, RVanderhaeghe, HJClaes, PJTulkens, PM New derivatives of kanamycin B obtained by modifications and substitutions in position 6''. 2. In vitro and computer-aided toxicological evaluation with respect to interactions with phosphatidylinositol. J Med Chem 34:1476-82 (1991)  
Target
Name:
Acyl-protein thioesterase 1
Synonyms:
Acyl-protein thioesterase 1/2 LYPA1_RAT Lysosomal phospholipase A1
Type:
PROTEIN
Mol. Mass.:
24708.49
Organism:
Rattus norvegicus
Description:
ChEMBL_12731
Residue:
230
  
Inhibitor
Name:
BDBM50011914
Synonyms:
5-amino-2-aminomethyl-6-[4,6-diamino-3-(4-amino-6-ethylsulfanylmethyl-3,5-dihydroxytetrahydro-2H-2-pyranyloxy)-2-hydroxycyclohexyloxy]tetrahydro-2H-3,4-pyrandiol | CHEMBL287460
Type:
Small organic molecule
Emp. Form.:
C20H41N5O9S
Mol. Mass.:
527.633
SMILES:
CCSCC1OC(OC2C(N)CC(N)C(OC3OC(CN)C(O)C(O)C3N)C2O)C(O)C(N)C1O
: