Target
Renin
Ligand
BDBM50012255
Substrate
Meas. Tech.
ChEBML_192887
IC50
4±n/a nM
Citation
 Repine, JTHimmelsbach, RJHodges, JCKaltenbronn, JSSircar, ISkeean, RWBrennan, STHurley, TRLunney, EHumblet, CC Renin inhibitors containing esters at the P2-position. Oral activity in a derivative of methyl aminomalonate. J Med Chem 34:1935-43 (1991)  
Target
Name:
Renin
Synonyms:
Angiotensinogenase RENI_HUMAN
Type:
Enzyme
Mol. Mass.:
45058.99
Organism:
Homo sapiens (Human)
Description:
Residue:
406
  
Inhibitor
Name:
BDBM50012255
Synonyms:
CHEMBL293328 | N-[1-Cyclohexylmethyl-2-hydroxy-3-(2-morpholin-4-yl-ethylcarbamoyl)-propyl]-2-[2-(morpholine-4-sulfonylamino)-3-phenyl-propionylamino]-malonamic acid methyl ester
Type:
Small organic molecule
Emp. Form.:
C34H54N6O10S
Mol. Mass.:
738.892
SMILES:
COC(=O)C(NC(=O)[C@H](Cc1ccccc1)NS(=O)(=O)N1CCOCC1)C(=O)N[C@@H](CC1CCCCC1)[C@@H](O)CC(=O)NCCN1CCOCC1
: