Target
Epidermal growth factor receptor
Ligand
BDBM50007070
Substrate
Meas. Tech.
ChEBML_66717
IC50
1800±n/a nM
Citation
 Traxler, PMWacker, OBach, HLGeissler, JFKump, WMeyer, TRegenass, URoesel, JLLydon, N Sulfonylbenzoyl-nitrostyrenes: potential bisubstrate type inhibitors of the EGF-receptor tyrosine protein kinase. J Med Chem 34:2328-37 (1991)  
Target
Name:
Epidermal growth factor receptor
Synonyms:
EGF Receptor Substrate EGFR_HUMAN ERBB1 Epidermal Growth Factor Receptor erbB-1 Epidermal growth factor receptor (EGFR) HER1 Proto-oncogene c-ErbB-1 Tyrosine-Protein Kinase ErbB-1
Type:
Receptor Kinase Domain
Mol. Mass.:
134279.59
Organism:
Homo sapiens (Human)
Description:
P00533
Residue:
1210
  
Inhibitor
Name:
BDBM50007070
Synonyms:
2-Hydroxy-4-[4-(2-nitro-vinyl)-phenoxysulfonyl]-benzoic acid methyl ester methyl 2-hydroxy-4-(4-(2-nitrovinyl)phenoxysulfonyl)benzoate
Type:
Small organic molecule
Emp. Form.:
C16H13NO8S
Mol. Mass.:
379.341
SMILES:
COC(=O)c1ccc(cc1O)[S+]([O-])(=O)Oc1ccc(\C=C\[N+]([O-])=O)cc1
: