Target
Gag-Pol polyprotein [489-587]
Ligand
BDBM50368288
Substrate
Meas. Tech.
ChEBML_159122
Ki
5±n/a nM
Citation
 Thaisrivongs, STomasselli, AGMoon, JBHui, JMcQuade, TJTurner, SRStrohbach, JWHowe, WJTarpley, WGHeinrikson, RL Inhibitors of the protease from human immunodeficiency virus: design and modeling of a compound containing a dihydroxyethylene isostere insert with high binding affinity and effective antiviral activity. J Med Chem 34:2344-56 (1991)  
Target
Name:
Gag-Pol polyprotein [489-587]
Synonyms:
Human immunodeficiency virus type 1 protease Pol polyprotein | gag-pol
Type:
Enzyme Subunit
Mol. Mass.:
10781.16
Organism:
Human immunodeficiency virus type 1
Description:
P04585[489-587]
Residue:
99
  
Inhibitor
Name:
BDBM50368288
Synonyms:
CHEMBL1790564 | CHEMBL3350194
Type:
Small organic molecule
Emp. Form.:
C38H55N7O7
Mol. Mass.:
721.886
SMILES:
CC[C@H](C)[C@H](NC(=O)[C@H](C(C)C)[C@@H](O)[C@H](O)[C@H](CC(C)C)NC(=O)[C@H](Cc1c[nH]cn1)NC(=O)COc1ccccc1)C(=O)NCc1ccccn1
: