Target
Alpha-1A/Alpha-1B/Alpha-1D adrenergic receptor
Ligand
BDBM50010040
Substrate
Meas. Tech.
ChEMBL_34149 (CHEMBL644948)
IC50
192±n/a nM
Citation
 Malleron, JLComte, MTGueremy, CPeyronel, JFTruchon, ABlanchard, JCDoble, APiot, OZundel, JLHuon, C Naphthosultam derivatives: a new class of potent and selective 5-HT2 antagonists. J Med Chem 34:2477-83 (1991)  
Target
Name:
Alpha-1A/Alpha-1B/Alpha-1D adrenergic receptor
Synonyms:
Adrenergic receptor alpha-1 alpha-1 Adrenergic Receptor
Type:
Mol. Mass.:
Description:
ASSAY_ID of EBI is 303470
Components:
This complex has 3 components.
Component 1
Name:
Alpha-1B adrenergic receptor
Synonyms:
ADA1B_RAT Alpha 1B-adrenoceptor Alpha adrenergic receptor 1A and 1B Alpha-1Adrenoceptor Alpha-1B adrenoreceptor | adrenergic Alpha1B
Type:
G Protein-Coupled Receptor (GPCR)
Mol. Mass.:
56606.71
Organism:
Rattus norvegicus (rat)
Description:
Receptor binding assays were performed using rat cortical membranes.
Residue:
515
  
Component 2
Name:
Alpha-1A adrenergic receptor
Synonyms:
ADA1A_RAT Adra1c Alpha-1A adrenoceptor Alpha-1C adrenergic receptor | adrenergic Alpha1A
Type:
Protein
Mol. Mass.:
51620.15
Organism:
Rattus norvegicus (Rat)
Description:
P43140
Residue:
466
  
Component 3
Name:
Alpha-1D adrenergic receptor
Synonyms:
ADA1D_RAT Adra1d Alpha-1D adrenergic receptor | Serotonin 1a (5-HT1a) receptor/Adrenergic receptor alpha-1
Type:
Protein
Mol. Mass.:
59375.97
Organism:
Rattus norvegicus (Rat)
Description:
P23944
Residue:
561
  
Inhibitor
Name:
BDBM50010040
Synonyms:
2-[3-(4-Phenyl-3,6-dihydro-2H-pyridin-1-yl)-propyl]-2H-naphtho[1,8-cd]isothiazole 1,1-dioxide | CHEMBL83787
Type:
Small organic molecule
Emp. Form.:
C24H24N2O2S
Mol. Mass.:
404.525
SMILES:
O=S1(=O)N(CCCN2CCC(=CC2)c2ccccc2)c2cccc3cccc1c23
: