Target
Aromatase
Ligand
BDBM50009433
Substrate
Meas. Tech.
ChEMBL_50722 (CHEMBL666801)
IC50
62000±n/a nM
Citation
 Numazawa, MMutsumi, AHoshi, KOshibe, MIshikawa, EKigawa, H Synthesis and biochemical studies of 16- or 19-substituted androst-4-enes as aromatase inhibitors. J Med Chem 34:2496-504 (1991)  
Target
Name:
Aromatase
Synonyms:
ARO1 CP19A_HUMAN CYP19 CYPXIX Cytochrome P450 19A1 Cytochrome P450-C19 (CYP19) FL cytokine receptor precursor | P-450AROM
Type:
Enzyme
Mol. Mass.:
57888.92
Organism:
Homo sapiens (Human)
Description:
P11511
Residue:
503
  
Inhibitor
Name:
BDBM50009433
Synonyms:
10-(1-Hydroxy-prop-2-ynyl)-13-methyl-1,2,3,6,7,8,9,10,11,12,13,14,15,16-tetradecahydro-cyclopenta[a]phenanthren-17-one | CHEMBL82981
Type:
Small organic molecule
Emp. Form.:
C21H28O2
Mol. Mass.:
312.4458
SMILES:
CC12CCC3C(CCC4=CCCCC34C(O)C#C)C1CCC2=O
: