Target
Aromatase
Ligand
BDBM50406551
Substrate
Meas. Tech.
ChEBML_50722
IC50
26000±n/a nM
Citation
 Numazawa, MMutsumi, AHoshi, KOshibe, MIshikawa, EKigawa, H Synthesis and biochemical studies of 16- or 19-substituted androst-4-enes as aromatase inhibitors. J Med Chem 34:2496-504 (1991)  
Target
Name:
Aromatase
Synonyms:
ARO1 CP19A_HUMAN CYP19 CYPXIX Cytochrome P450 19A1 Cytochrome P450-C19 (CYP19) FL cytokine receptor precursor | P-450AROM
Type:
Enzyme
Mol. Mass.:
57888.92
Organism:
Homo sapiens (Human)
Description:
P11511
Residue:
503
  
Inhibitor
Name:
BDBM50406551
Synonyms:
CHEMBL2112309
Type:
Small organic molecule
Emp. Form.:
C19H28F2O
Mol. Mass.:
310.4218
SMILES:
C[C@]12CC[C@H]3[C@@H](CCC4=CCCC[C@]34C(F)F)[C@@H]1CC[C@@H]2O
: