Target
Adenosine receptor A2a/A2b
Ligand
BDBM50009679
Substrate
Meas. Tech.
ChEMBL_153751 (CHEMBL761206)
Ki
21000±n/a nM
Citation
 Thompson, RDSecunda, SDaly, JWOlsson, RA N6,9-disubstituted adenines: potent, selective antagonists at the A1 adenosine receptor. J Med Chem 34:2877-82 (1991)  
Target
Name:
Adenosine receptor A2a/A2b
Synonyms:
Adenosine A2 receptor
Type:
Mol. Mass.:
Description:
ASSAY_ID of ChEMBL is 30560
Components:
This complex has 2 components.
Component 1
Name:
Adenosine receptor A2b
Synonyms:
AA2BR_RAT Adora2b
Type:
PROTEIN
Mol. Mass.:
36378.84
Organism:
Rattus norvegicus
Description:
ChEMBL_32934
Residue:
332
  
Component 2
Name:
Adenosine receptor A2a
Synonyms:
AA2AR_RAT Adenosine A2 receptor Adenosine Receptors A2a (A2a) Adenosine receptors A2a Rat striatal adenosine A2a receptor
Type:
G Protein-Coupled Receptor (GPCR)
Mol. Mass.:
45015.65
Organism:
Rattus norvegicus (rat)
Description:
Rat A2A receptors expressed in CHO cells.
Residue:
410
  
Inhibitor
Name:
BDBM50009679
Synonyms:
(2-Chloro-9-methyl-9H-purin-6-yl)-phenyl-amine | CHEMBL98779
Type:
Small organic molecule
Emp. Form.:
C12H10ClN5
Mol. Mass.:
259.694
SMILES:
Cn1cnc2c(Nc3ccccc3)nc(Cl)nc12
: