Target
Adenosine receptor A2a/A2b
Ligand
BDBM50009700
Substrate
Meas. Tech.
ChEMBL_30726 (CHEMBL648805)
Ki
15000±n/a nM
Citation
 Thompson, RDSecunda, SDaly, JWOlsson, RA N6,9-disubstituted adenines: potent, selective antagonists at the A1 adenosine receptor. J Med Chem 34:2877-82 (1991)  
Target
Name:
Adenosine receptor A2a/A2b
Synonyms:
Adenosine A2 receptor
Type:
Mol. Mass.:
Description:
ASSAY_ID of ChEMBL is 30560
Components:
This complex has 2 components.
Component 1
Name:
Adenosine receptor A2b
Synonyms:
AA2BR_RAT Adora2b
Type:
PROTEIN
Mol. Mass.:
36378.84
Organism:
Rattus norvegicus
Description:
ChEMBL_32934
Residue:
332
  
Component 2
Name:
Adenosine receptor A2a
Synonyms:
AA2AR_RAT Adenosine A2 receptor Adenosine Receptors A2a (A2a) Adenosine receptors A2a Rat striatal adenosine A2a receptor
Type:
G Protein-Coupled Receptor (GPCR)
Mol. Mass.:
45015.65
Organism:
Rattus norvegicus (rat)
Description:
Rat A2A receptors expressed in CHO cells.
Residue:
410
  
Inhibitor
Name:
BDBM50009700
Synonyms:
(1-Phenyl-propyl)-(9-phenyl-9H-purin-6-yl)-amine | CHEMBL95936
Type:
Small organic molecule
Emp. Form.:
C20H19N5
Mol. Mass.:
329.3984
SMILES:
CC[C@@H](Nc1ncnc2n(cnc12)-c1ccccc1)c1ccccc1
: