Target
Renin
Ligand
BDBM50008144
Substrate
Meas. Tech.
ChEBML_192731
IC50
0.690000±n/a nM
Citation
 Doherty, AMSircar, IKornberg, BEQuin, JWinters, RTKaltenbronn, JSTaylor, MDBatley, BLRapundalo, SRRyan, MJ Design and synthesis of potent, selective, and orally active fluorine-containing renin inhibitors. J Med Chem 35:2-14 (1992)  
Target
Name:
Renin
Synonyms:
Angiotensinogenase RENI_HUMAN
Type:
Enzyme
Mol. Mass.:
45058.99
Organism:
Homo sapiens (Human)
Description:
Residue:
406
  
Inhibitor
Name:
BDBM50008144
Synonyms:
4-{3-(2-Amino-thiazol-4-yl)-2-[2-(morpholine-4-sulfonylamino)-3-phenyl-propionylamino]-propionylamino}-5-cyclohexyl-2,2-difluoro-3-hydroxy-pentanoic acid (2-morpholin-4-yl-ethyl)-amide; Hydrate | CHEMBL31889
Type:
Small organic molecule
Emp. Form.:
C36H54F2N8O8S2
Mol. Mass.:
828.99
SMILES:
Nc1nc(C[C@H](NC(=O)[C@H](Cc2ccccc2)NS(=O)(=O)N2CCOCC2)C(=O)N[C@@H](CC2CCCCC2)C(O)C(F)(F)C(=O)NCCN2CCOCC2)cs1
: