Target
Cathepsin D
Ligand
BDBM50008125
Substrate
Meas. Tech.
ChEBML_44987
IC50
17730±n/a nM
Citation
 Doherty, AMSircar, IKornberg, BEQuin, JWinters, RTKaltenbronn, JSTaylor, MDBatley, BLRapundalo, SRRyan, MJ Design and synthesis of potent, selective, and orally active fluorine-containing renin inhibitors. J Med Chem 35:2-14 (1992)  
Target
Name:
Cathepsin D
Synonyms:
CATD_BOVIN | CTSD
Type:
PROTEIN
Mol. Mass.:
42158.92
Organism:
Bos taurus
Description:
ChEMBL_1458606
Residue:
387
  
Inhibitor
Name:
BDBM50008125
Synonyms:
CHEMBL285207 | N-[1-Cyclohexylmethyl-3,3-difluoro-2-hydroxy-3-(2-morpholin-4-yl-ethylcarbamoyl)-propyl]-2-[2-(morpholine-4-sulfonylamino)-3-phenyl-propionylamino]-malonamic acid methyl ester; methyl alcohol
Type:
Small organic molecule
Emp. Form.:
C34H52F2N6O10S
Mol. Mass.:
774.873
SMILES:
COC(=O)[C@H](NC(=O)[C@H](Cc1ccccc1)NS(=O)(=O)N1CCOCC1)C(=O)N[C@@H](CC1CCCCC1)C(O)C(F)(F)C(=O)NCCN1CCOCC1
: