Target
Gastrin/cholecystokinin type B receptor
Ligand
BDBM50008165
Substrate
Meas. Tech.
ChEBML_216728
IC50
1900±n/a nM
Citation
 Makovec, FPeris, WRevel, LGiovanetti, RMennuni, LRovati, LC Structure-antigastrin activity relationships of new (R)-4-benzamido-5-oxopentanoic acid derivatives. J Med Chem 35:28-38 (1992)  
Target
Name:
Gastrin/cholecystokinin type B receptor
Synonyms:
Cckbr Cholecystokinin B receptor GASR_RAT | Gastrin/cholecystokinin type B receptor
Type:
Enzyme Catalytic Domain
Mol. Mass.:
48980.43
Organism:
RAT
Description:
Cholecystokinin A CCKBR RAT::P30553
Residue:
452
  
Inhibitor
Name:
BDBM50008165
Synonyms:
4-(3-Chloro-benzoylamino)-4-(decahydro-naphthalen-2-ylcarbamoyl)-butyric acid | CHEMBL341143
Type:
Small organic molecule
Emp. Form.:
C22H29ClN2O4
Mol. Mass.:
420.93
SMILES:
OC(=O)CCC(NC(=O)c1cccc(Cl)c1)C(=O)NC1CCC2CCCCC2C1
: