Target
Cholecystokinin receptor type A
Ligand
BDBM50008192
Substrate
Meas. Tech.
ChEBML_50058
IC50
20800±n/a nM
Citation
 Makovec, FPeris, WRevel, LGiovanetti, RMennuni, LRovati, LC Structure-antigastrin activity relationships of new (R)-4-benzamido-5-oxopentanoic acid derivatives. J Med Chem 35:28-38 (1992)  
Target
Name:
Cholecystokinin receptor type A
Synonyms:
CCKAR_RAT Cholecystokinin peripheral Cholecystokinin receptor type A
Type:
Enzyme Catalytic Domain
Mol. Mass.:
49676.37
Organism:
RAT
Description:
Cholecystokinin central 0 RAT::P30551
Residue:
444
  
Inhibitor
Name:
BDBM50008192
Synonyms:
4-(8-Aza-spiro[4.5]dec-8-ylcarbamoyl)-4-(2,3-dichloro-benzoylamino)-butyric acid | CHEMBL421474
Type:
Small organic molecule
Emp. Form.:
C21H27Cl2N3O4
Mol. Mass.:
456.363
SMILES:
OC(=O)CCC(NC(=O)c1cccc(Cl)c1Cl)C(=O)NN1CCC2(CCCC2)CC1
: