Target
Gastrin/cholecystokinin type B receptor
Ligand
BDBM50008217
Substrate
Meas. Tech.
ChEBML_216728
IC50
3300±n/a nM
Citation
 Makovec, FPeris, WRevel, LGiovanetti, RMennuni, LRovati, LC Structure-antigastrin activity relationships of new (R)-4-benzamido-5-oxopentanoic acid derivatives. J Med Chem 35:28-38 (1992)  
Target
Name:
Gastrin/cholecystokinin type B receptor
Synonyms:
Cckbr Cholecystokinin B receptor GASR_RAT | Gastrin/cholecystokinin type B receptor
Type:
Enzyme Catalytic Domain
Mol. Mass.:
48980.43
Organism:
RAT
Description:
Cholecystokinin A CCKBR RAT::P30553
Residue:
452
  
Inhibitor
Name:
BDBM50008217
Synonyms:
4-(3-Chloro-benzoylamino)-4-(4,4-diethyl-cyclohexylcarbamoyl)-butyric acid | CHEMBL339115
Type:
Small organic molecule
Emp. Form.:
C22H31ClN2O4
Mol. Mass.:
422.946
SMILES:
CCC1(CC)CCC(CC1)NC(=O)C(CCC(O)=O)NC(=O)c1cccc(Cl)c1
: