Target
Reverse transcriptase/RNaseH
Ligand
BDBM50002465
Substrate
Meas. Tech.
ChEMBL_195520 (CHEMBL800588)
IC50
100±n/a nM
Citation
 Ma, QFBathurst, ICBarr, PJKenyon, GL New thymidine triphosphate analogue inhibitors of human immunodeficiency virus-1 reverse transcriptase. J Med Chem 35:1938-41 (1992)  
Target
Name:
Reverse transcriptase/RNaseH
Synonyms:
HIV-1 Reverse Transcriptase RNase H Reverse transcriptase/RNaseH
Type:
PROTEIN
Mol. Mass.:
65229.15
Organism:
Human immunodeficiency virus 1
Description:
ChEMBL_1473730
Residue:
566
  
Inhibitor
Name:
BDBM50002465
Synonyms:
AZTMPPNP3'-azidothymidine 5'-[alpha,beta-imido]triphosphate
Type:
Small organic molecule
Emp. Form.:
C9H11N6O12P3
Mol. Mass.:
488.1401
SMILES:
Cc1cn([C@H]2C[C@@H](N=[N+]=[N-])[C@@H](OP([O-])(=O)OP([O-])(=O)NP([O-])([O-])=O)O2)c(=O)[nH]c1=O
: