Target
Integrin alpha-IIb/beta-3
Ligand
BDBM50006302
Substrate
Meas. Tech.
ChEMBL_89731 (CHEMBL696585)
IC50
610±n/a nM
Citation
 Barker, PLBullens, SBunting, SBurdick, DJChan, KSDeisher, TEigenbrot, CGadek, TRGantzos, RLipari, MT Cyclic RGD peptide analogues as antiplatelet antithrombotics. J Med Chem 35:2040-8 (1992)  
Target
Name:
Integrin alpha-IIb/beta-3
Synonyms:
Glycoprotein IIb/IIIa
Type:
Mol. Mass.:
Description:
ASSAY_ID of EBI is 30109
Components:
This complex has 2 components.
Component 1
Name:
Integrin beta-3
Synonyms:
CD_antigen=CD61 GPIIIa ITGB3 Platelet membrane glycoprotein IIIa
Type:
Protein
Mol. Mass.:
87038.91
Organism:
Homo sapiens (Human)
Description:
P05106
Residue:
788
  
Component 2
Name:
Integrin alpha-IIb
Synonyms:
CD_antigen=CD41 GPIIb Glycoprotein IIb ITGA2B Integrin alpha-IIb heavy chain Integrin alpha-IIb light chain, form 2 Integrin alpha-V/beta-3 and alpha-IIb/beta 3 | Platelet membrane glycoprotein IIb
Type:
Protein
Mol. Mass.:
113354.85
Organism:
Homo sapiens (Human)
Description:
P08514
Residue:
1039
  
Inhibitor
Name:
BDBM50006302
Synonyms:
6-Carboxymethyl-12-(3-guanidino-propyl)-15-methyl-1,5,8,11,14,17-hexaoxo-1lambda*4*-thia-4,7,10,13,16-pentaaza-cyclooctadecane-3-carboxylic acid | CHEMBL293428
Type:
Small organic molecule
Emp. Form.:
C20H32N8O10S
Mol. Mass.:
576.581
SMILES:
C[C@@H]1NC(=O)CS(=O)C[C@H](NC(=O)[C@H](CC(O)=O)NC(=O)CNC(=O)[C@H](CCCNC(N)=N)NC1=O)C(O)=O
: