Target
D(2) dopamine receptor
Ligand
BDBM50132693
Substrate
Meas. Tech.
ChEMBL_61743 (CHEMBL676050)
IC50
17±n/a nM
Citation
 Pettersson, ILiljefors, T Conformational analysis of dopamine D-2 receptor antagonists of the benzamide series in relation to a recently proposed D-2 receptor-interaction model. J Med Chem 35:2355-63 (1992)  
Target
Name:
D(2) dopamine receptor
Synonyms:
DOPAMINE D2 DOPAMINE D2 Short Dopamine D2 receptor Drd2
Type:
G Protein-Coupled Receptor (GPCR)
Mol. Mass.:
50931.60
Organism:
Rattus norvegicus (rat)
Description:
P61169
Residue:
444
  
Inhibitor
Name:
BDBM50132693
Synonyms:
4-Amino-N-(1-benzyl-piperidin-4-yl)-5-chloro-2-methoxy-benzamide 4-amino-N-(1-benzylpiperidin-4-yl)-5-chloro-2-methoxybenzamide Clebopride
Type:
Small organic molecule
Emp. Form.:
C20H24ClN3O2
Mol. Mass.:
373.876
SMILES:
COc1cc(N)c(Cl)cc1C(=O)NC1CCN(Cc2ccccc2)CC1
: