Target
Transporter
Ligand
BDBM50006787
Substrate
Meas. Tech.
ChEBML_142625
IC50
15756±n/a nM
Citation
 Carroll, FIAbraham, PLewin, AHParham, KABoja, JWKuhar, M Isopropyl and phenyl esters of 3 beta-(4-substituted phenyl)tropan-2 beta-carboxylic acids. Potent and selective compounds for the dopamine transporter. J Med Chem 35:2497-500 (1992)  
Target
Name:
Transporter
Synonyms:
Monoamine transporters; Norepininephrine & dopamine | Norepinephrine Monoamine transporters
Type:
PROTEIN
Mol. Mass.:
66787.87
Organism:
Rattus norvegicus
Description:
ChEMBL_1463061
Residue:
597
  
Inhibitor
Name:
BDBM50006787
Synonyms:
3-Benzoyloxy-8-methyl-8-aza-bicyclo[3.2.1]octane-2-carboxylic acid propyl ester | CHEMBL311177
Type:
Small organic molecule
Emp. Form.:
C19H25NO4
Mol. Mass.:
331.4061
SMILES:
CCCOC(=O)[C@@H]1C2CC[C@H](C[C@@H]1OC(=O)c1ccccc1)N2C
: