Target
Prostaglandin G/H synthase 1/2
Ligand
BDBM50006795
Substrate
Meas. Tech.
ChEMBL_158286 (CHEMBL764936)
IC50
6300±n/a nM
Citation
 Musser, JHKreft, AF 5-lipoxygenase: properties, pharmacology, and the quinolinyl(bridged)aryl class of inhibitors. J Med Chem 35:2501-24 (1992)  
Target
Name:
Prostaglandin G/H synthase 1/2
Synonyms:
Cyclooxygenase
Type:
Mol. Mass.:
Description:
ASSAY_ID of ChEMBL is 1666355
Components:
This complex has 2 components.
Component 1
Name:
Prostaglandin G/H synthase 2
Synonyms:
Cox-2 Cyclooxygenase Ptgs2
Type:
Enzyme Catalytic Domain
Mol. Mass.:
69173.51
Organism:
RAT
Description:
COX-2 0 RAT::P35355
Residue:
604
  
Component 2
Name:
Prostaglandin G/H synthase 1
Synonyms:
Cox-1 Cyclooxygenase PGH1_RAT Ptgs1
Type:
Enzyme Catalytic Domain
Mol. Mass.:
69033.56
Organism:
RAT
Description:
COX-1 0 RAT::Q63921
Residue:
602
  
Inhibitor
Name:
BDBM50006795
Synonyms:
2-(Naphthalen-1-yloxymethyl)-quinoline WY-47288
Type:
Small organic molecule
Emp. Form.:
C20H15NO
Mol. Mass.:
285.3392
SMILES:
C(Oc1cccc2ccccc12)c1ccc2ccccc2n1
: