Target
Polyunsaturated fatty acid 5-lipoxygenase
Ligand
BDBM50006795
Substrate
Meas. Tech.
ChEBML_740
IC50
400±n/a nM
Citation
 Musser, JHKreft, AF 5-lipoxygenase: properties, pharmacology, and the quinolinyl(bridged)aryl class of inhibitors. J Med Chem 35:2501-24 (1992)  
Target
Name:
Polyunsaturated fatty acid 5-lipoxygenase
Synonyms:
Alox5 LOX5_RAT
Type:
PROTEIN
Mol. Mass.:
78082.31
Organism:
Rattus norvegicus
Description:
ChEMBL_1432947
Residue:
673
  
Inhibitor
Name:
BDBM50006795
Synonyms:
2-(Naphthalen-1-yloxymethyl)-quinoline WY-47288
Type:
Small organic molecule
Emp. Form.:
C20H15NO
Mol. Mass.:
285.3392
SMILES:
C(Oc1cccc2ccccc12)c1ccc2ccccc2n1
: