Target
Cholecystokinin receptor type A
Ligand
BDBM50455597
Substrate
Meas. Tech.
ChEMBL_49401 (CHEMBL658763)
IC50
1700±n/a nM
Citation
 Drysdale, MJPritchard, MCHorwell, DC Rationally designed"dipeptoid" analogues of CCK. Acid mimics of the potent and selective non-peptide CCK-B receptor antagonist CI-988. J Med Chem 35:2573-81 (1992)  
Target
Name:
Cholecystokinin receptor type A
Synonyms:
CCKAR_RAT Cholecystokinin peripheral Cholecystokinin receptor type A
Type:
Enzyme Catalytic Domain
Mol. Mass.:
49676.37
Organism:
RAT
Description:
Cholecystokinin central 0 RAT::P30551
Residue:
444
  
Inhibitor
Name:
BDBM50455597
Synonyms:
CHEMBL2112334
Type:
Small organic molecule
Emp. Form.:
C36H41N5O6
Mol. Mass.:
639.7406
SMILES:
[H][C@](CNC(=O)[C@](C)(Cc1c[nH]c2ccccc12)NC(=O)OC1C2CC3CC(C2)CC1C3)(NC(=O)Cc1cc(O)no1)c1ccccc1
: