Target
Thymidylate synthase
Ligand
BDBM50004380
Substrate
Meas. Tech.
ChEBML_209812
IC50
800±n/a nM
Citation
 Warner, PBarker, AJJackman, ALBurrows, KDRoberts, NBishop, JAO'Connor, BMHughes, LR Quinoline antifolate thymidylate synthase inhibitors: variation of the C2- and C4-substituents. J Med Chem 35:2761-8 (1992)  
Target
Name:
Thymidylate synthase
Synonyms:
TS TYSY_MOUSE | Tyms
Type:
PROTEIN
Mol. Mass.:
34957.15
Organism:
Mus musculus
Description:
ChEMBL_1340097
Residue:
307
  
Inhibitor
Name:
BDBM50004380
Synonyms:
2-{4-[(2,4-Dimethyl-quinolin-6-ylmethyl)-prop-2-ynyl-amino]-benzoylamino}-pentanedioic acid ; hydrate | CHEMBL328247
Type:
Small organic molecule
Emp. Form.:
C27H27N3O5
Mol. Mass.:
473.5204
SMILES:
Cc1cc(C)c2cc(CN(CC#C)c3ccc(cc3)C(=O)N[C@@H](CCC(O)=O)C(O)=O)ccc2n1
: