Target
Thymidylate synthase
Ligand
BDBM50004366
Substrate
Meas. Tech.
ChEBML_209812
IC50
1200±n/a nM
Citation
 Warner, PBarker, AJJackman, ALBurrows, KDRoberts, NBishop, JAO'Connor, BMHughes, LR Quinoline antifolate thymidylate synthase inhibitors: variation of the C2- and C4-substituents. J Med Chem 35:2761-8 (1992)  
Target
Name:
Thymidylate synthase
Synonyms:
TS TYSY_MOUSE | Tyms
Type:
PROTEIN
Mol. Mass.:
34957.15
Organism:
Mus musculus
Description:
ChEMBL_1340097
Residue:
307
  
Inhibitor
Name:
BDBM50004366
Synonyms:
2-{4-[(2-Acetylamino-4-chloro-quinolin-6-ylmethyl)-prop-2-ynyl-amino]-benzoylamino}-pentanedioic acid; TFA with hydrate | CHEMBL327692
Type:
Small organic molecule
Emp. Form.:
C27H25ClN4O6
Mol. Mass.:
536.964
SMILES:
CC(=O)Nc1cc(Cl)c2cc(CN(CC#C)c3ccc(cc3)C(=O)N[C@@H](CCC(O)=O)C(O)=O)ccc2n1
: