Target
Adenosine receptor A2a
Ligand
BDBM50368362
Substrate
Meas. Tech.
ChEBML_29154
Ki
11±1.6 nM
Citation
 Homma, HWatanabe, YAbiru, TMurayama, TNomura, YMatsuda, A Nucleosides and nucleotides. 112. 2-(1-Hexyn-1-yl)adenosine-5'-uronamides: a new entry of selective A2 adenosine receptor agonists with potent antihypertensive activity. J Med Chem 35:2881-90 (1992)  
Target
Name:
Adenosine receptor A2a
Synonyms:
AA2AR_RAT Adenosine A2 receptor Adenosine Receptors A2a (A2a) Adenosine receptors A2a Rat striatal adenosine A2a receptor
Type:
G Protein-Coupled Receptor (GPCR)
Mol. Mass.:
45015.65
Organism:
Rattus norvegicus (rat)
Description:
Rat A2A receptors expressed in CHO cells.
Residue:
410
  
Inhibitor
Name:
BDBM50368362
Synonyms:
2-(l-hexyn-l-yl)-adenosine-5'-N-methyluronamide (16b) | CHEMBL609211
Type:
Small organic molecule
Emp. Form.:
C17H22N6O4
Mol. Mass.:
374.3944
SMILES:
CCCCC#Cc1nc(N)c2ncn(C3O[C@@H]([C@@H](O)[C@H]3O)C(=O)NC)c2n1
: