Target
Adenosine receptor A1
Ligand
BDBM65453
Substrate
Meas. Tech.
ChEBML_29154
Ki
1807±192 nM
Citation
 Homma, HWatanabe, YAbiru, TMurayama, TNomura, YMatsuda, A Nucleosides and nucleotides. 112. 2-(1-Hexyn-1-yl)adenosine-5'-uronamides: a new entry of selective A2 adenosine receptor agonists with potent antihypertensive activity. J Med Chem 35:2881-90 (1992)  
Target
Name:
Adenosine receptor A1
Synonyms:
AA1R_RAT ADENOSINE A1 high Adenosine A1 receptor (A1) Adenosine receptors A1 | Adora1
Type:
Protein
Mol. Mass.:
36704.13
Organism:
Rattus norvegicus (rat)
Description:
Residue:
326
  
Inhibitor
Name:
BDBM65453
Synonyms:
2-(l-hexyn-l-yl)-adenosine-5'-N-methyluronamide (16e)
Type:
Emp. Form.:
C19H26N6O4
Mol. Mass.:
402.4475
SMILES:
CCCCC#Cc1nc(N)c2ncn([C@@H]3O[C@@H]([C@@H](O)[C@H]3O)C(=O)NC(C)C)c2n1
: