Target
Histamine H1 receptor
Ligand
BDBM50368368
Substrate
Meas. Tech.
ChEMBL_218827 (CHEMBL823938)
IC50
25000±n/a nM
Citation
 Diurno, MVMazzoni, OPiscopo, ECalignano, AGiordano, FBolognese, A Synthesis and antihistaminic activity of some thiazolidin-4-ones. J Med Chem 35:2910-2 (1992)  
Target
Name:
Histamine H1 receptor
Synonyms:
HISTAMINE H1 HRH1_CAVPO
Type:
G Protein-Coupled Receptor (GPCR)
Mol. Mass.:
55641.53
Organism:
Cavia porcellus (domestic guinea pig)
Description:
Guinea pig cerebellum was used in binding assay.
Residue:
488
  
Inhibitor
Name:
BDBM50368368
Synonyms:
CHEMBL1202941
Type:
Small organic molecule
Emp. Form.:
C15H22N2O2S
Mol. Mass.:
294.412
SMILES:
COc1cccc(c1)C1SCC(=O)N1CCCN(C)C
: