Target
Polyunsaturated fatty acid 5-lipoxygenase
Ligand
BDBM50001184
Substrate
Meas. Tech.
ChEBML_98492
EC50
160±n/a nM
Citation
 Greco, MNHageman, WEPowell, ETTighe, JJPersico, FJ Benzothiazole hydroxy ureas as inhibitors of 5-lipoxygenase: use of the hydroxyurea moiety as a replacement for hydroxamic acid. J Med Chem 35:3180-3 (1992)  
Target
Name:
Polyunsaturated fatty acid 5-lipoxygenase
Synonyms:
5-LO 5-Lipoxygenase (5-LO) 5-Lipoygenase ALOX5 LOG5 | LOX5_HUMAN
Type:
Enzyme
Mol. Mass.:
77972.74
Organism:
Homo sapiens (Human)
Description:
Recombinant protein was purified from E. coli lysate. After ammonium sulfate precipitation and subsequent steps, the supernatant (S100) was used for 5-LO activity assay.
Residue:
674
  
Inhibitor
Name:
BDBM50001184
Synonyms:
2-(6-Isopropyl-benzothiazol-2-ylsulfanyl)-ethylamine-N-methyl-N-hydroxy carboxamide | CHEMBL106206
Type:
Small organic molecule
Emp. Form.:
C14H19N3O2S2
Mol. Mass.:
325.45
SMILES:
CC(C)c1ccc2nc(SCCNC(=O)N(C)O)sc2c1
: