Target
Polyunsaturated fatty acid 5-lipoxygenase
Ligand
BDBM50001185
Substrate
Meas. Tech.
ChEBML_98492
EC50
24500±n/a nM
Citation
 Greco, MNHageman, WEPowell, ETTighe, JJPersico, FJ Benzothiazole hydroxy ureas as inhibitors of 5-lipoxygenase: use of the hydroxyurea moiety as a replacement for hydroxamic acid. J Med Chem 35:3180-3 (1992)  
Target
Name:
Polyunsaturated fatty acid 5-lipoxygenase
Synonyms:
5-LO 5-Lipoxygenase (5-LO) 5-Lipoygenase ALOX5 LOG5 | LOX5_HUMAN
Type:
Enzyme
Mol. Mass.:
77972.74
Organism:
Homo sapiens (Human)
Description:
Recombinant protein was purified from E. coli lysate. After ammonium sulfate precipitation and subsequent steps, the supernatant (S100) was used for 5-LO activity assay.
Residue:
674
  
Inhibitor
Name:
BDBM50001185
Synonyms:
2-(5-Chloro-benzothiazol-2-ylsulfanyl)-ethylamine-N-hydroxy carboxamide | CHEMBL108538
Type:
Small organic molecule
Emp. Form.:
C10H10ClN3O2S2
Mol. Mass.:
303.788
SMILES:
ONC(=O)NCCSc1nc2cc(Cl)ccc2s1
: