Target
Urokinase-type plasminogen activator
Ligand
BDBM50368379
Substrate
Meas. Tech.
ChEBML_210761
Ki
494000±n/a nM
Citation
 Cheng, LGoodwin, CASchully, MFKakkar, VVClaeson, G Synthesis and biological activity of ketomethylene pseudopeptide analogues as thrombin inhibitors. J Med Chem 35:3364-9 (1992)  
Target
Name:
Urokinase-type plasminogen activator
Synonyms:
PLAU UROK_HUMAN Urokinase-type plasminogen activator (uPA) | Urokinase-type plasminogen activator/surface receptor
Type:
Enzyme
Mol. Mass.:
48528.62
Organism:
Homo sapiens (Human)
Description:
P00749
Residue:
431
  
Inhibitor
Name:
BDBM50368379
Synonyms:
CHEMBL1202120
Type:
Small organic molecule
Emp. Form.:
C34H47N7O4
Mol. Mass.:
617.7815
SMILES:
[#7]-[#6@H](-[#6](-c1ccccc1)-c1ccccc1)-[#6](=O)-[#7]-1-[#6]-[#6]-[#6]-[#6@H]-1-[#6](=O)-[#7]-[#6](-[#6]-[#6]-[#6]\[#7]=[#6](\[#7])-[#7])-[#6](=O)-[#6]-[#6]-[#6](=O)-[#7]-1-[#6]-[#6]-[#6]-[#6]-[#6]-1
: