Target
Polyunsaturated fatty acid 5-lipoxygenase
Ligand
BDBM50003123
Substrate
Meas. Tech.
ChEMBL_3898 (CHEMBL619903)
IC50
1200±n/a nM
Citation
 Unangst, PCShrum, GPConnor, DTDyer, RDSchrier, DJ Novel 1,2,4-oxadiazoles and 1,2,4-thiadiazoles as dual 5-lipoxygenase and cyclooxygenase inhibitors. J Med Chem 35:3691-8 (1992)  
Target
Name:
Polyunsaturated fatty acid 5-lipoxygenase
Synonyms:
Alox5 LOX5_RAT
Type:
PROTEIN
Mol. Mass.:
78082.31
Organism:
Rattus norvegicus
Description:
ChEMBL_1432947
Residue:
673
  
Inhibitor
Name:
BDBM50003123
Synonyms:
1-[3-(3,5-Di-tert-butyl-4-hydroxy-phenyl)-[1,2,4]thiadiazol-5-yl]-2-methyl-isothiourea; hydrochloride | CHEMBL543650
Type:
Small organic molecule
Emp. Form.:
C18H26N4OS2
Mol. Mass.:
378.555
SMILES:
CSC(N)=Nc1nc(ns1)-c1cc(c(O)c(c1)C(C)(C)C)C(C)(C)C
: