Target
Polyunsaturated fatty acid 5-lipoxygenase
Ligand
BDBM50003118
Substrate
Meas. Tech.
ChEMBL_3898 (CHEMBL619903)
IC50
7700±n/a nM
Citation
 Unangst, PCShrum, GPConnor, DTDyer, RDSchrier, DJ Novel 1,2,4-oxadiazoles and 1,2,4-thiadiazoles as dual 5-lipoxygenase and cyclooxygenase inhibitors. J Med Chem 35:3691-8 (1992)  
Target
Name:
Polyunsaturated fatty acid 5-lipoxygenase
Synonyms:
Alox5 LOX5_RAT
Type:
PROTEIN
Mol. Mass.:
78082.31
Organism:
Rattus norvegicus
Description:
ChEMBL_1432947
Residue:
673
  
Inhibitor
Name:
BDBM50003118
Synonyms:
2,6-Di-tert-butyl-4-(5-dimethylaminomethyl-[1,2,4]oxadiazol-3-yl)-phenol; hydrochloride | CHEMBL542941
Type:
Small organic molecule
Emp. Form.:
C19H29N3O2
Mol. Mass.:
331.4525
SMILES:
CN(C)Cc1nc(no1)-c1cc(c(O)c(c1)C(C)(C)C)C(C)(C)C
: