Target
Amine oxidase [flavin-containing] A
Ligand
BDBM50003142
Substrate
Meas. Tech.
ChEBML_122940
IC50
120000±n/a nM
Citation
 Yu, PHDavis, BABoulton, AA Aliphatic propargylamines: potent, selective, irreversible monoamine oxidase B inhibitors. J Med Chem 35:3705-13 (1992)  
Target
Name:
Amine oxidase [flavin-containing] A
Synonyms:
AOFA_RAT Amine oxidase [flavin-containing] A Monoamine Oxidase Type A (MAO-A) Monoamine oxidase A (MAO-A) Monoamine oxidase type A (MAOA)
Type:
Enzyme
Mol. Mass.:
59515.21
Organism:
Rattus norvegicus (rat)
Description:
Residue:
526
  
Inhibitor
Name:
BDBM50003142
Synonyms:
CHEMBL273540 | Methyl-pentyl-prop-2-ynyl-amine; oxalic acid
Type:
Small organic molecule
Emp. Form.:
C9H17N
Mol. Mass.:
139.238
SMILES:
CCCCCN(C)CC#C
: