Target
Gag-Pol polyprotein [489-587]
Ligand
BDBM50368432
Substrate
Meas. Tech.
ChEBML_157563
Ki
20±n/a nM
Citation
 Rich, DHPrasad, JVSun, CQGreen, JMueller, RHouseman, KMacKenzie, DMalkovsky, M New hydroxyethylamine HIV protease inhibitors that suppress viral replication. J Med Chem 35:3803-12 (1992)  
Target
Name:
Gag-Pol polyprotein [489-587]
Synonyms:
Human immunodeficiency virus type 1 protease Pol polyprotein | gag-pol
Type:
Enzyme Subunit
Mol. Mass.:
10781.16
Organism:
Human immunodeficiency virus type 1
Description:
P04585[489-587]
Residue:
99
  
Inhibitor
Name:
BDBM50368432
Synonyms:
CHEMBL1790879 | CHEMBL3349490
Type:
Small organic molecule
Emp. Form.:
C46H69N7O10
Mol. Mass.:
880.081
SMILES:
[H][C@@](O)(CN1CCCC1C(=O)N[C@@H]([C@@H](C)CC)C(=O)N[C@@H](C(C)C)C(=O)OC)[C@H](Cc1ccccc1)NC(=O)[C@H](CC(N)=O)NC(=O)[C@H](CCc1ccccc1)NC(=O)OC(C)(C)C
: