Target
Beta-2 adrenergic receptor
Ligand
BDBM50002151
Substrate
Meas. Tech.
ChEBML_37987
Ki
1700±n/a nM
Citation
 Meurer, LCTolman, RLChapin, EWSaperstein, RVicario, PPZrada, MMMacCoss, M Synthesis and hypoglycemic activity of substituted 8-(1-piperazinyl)imidazo[1,2-a]pyrazines. J Med Chem 35:3845-57 (1992)  
Target
Name:
Beta-2 adrenergic receptor
Synonyms:
ADRB2_CAVPO adrenergic Beta2
Type:
Enzyme Catalytic Domain
Mol. Mass.:
46993.24
Organism:
GUINEA PIG
Description:
adrenergic Beta2 ADRB2 GUINEA PIG::Q8K4Z4
Residue:
418
  
Inhibitor
Name:
BDBM50002151
Synonyms:
8-Piperazin-1-yl-imidazo[1,2-a]pyrazine L-639,019
Type:
Small organic molecule
Emp. Form.:
C10H13N5
Mol. Mass.:
203.2437
SMILES:
C1CN(CCN1)c1nccn2ccnc12
: