Target
Oxytocin receptor
Ligand
BDBM50001325
Substrate
Meas. Tech.
ChEBML_149178
IC50
1500±n/a nM
Citation
 Williams, PDBock, MGTung, RDGarsky, VMPerlow, DSErb, JMLundell, GFGould, NPWhitter, WLHoffman, JB Development of a novel class of cyclic hexapeptide oxytocin antagonists based on a natural product. J Med Chem 35:3905-18 (1992)  
Target
Name:
Oxytocin receptor
Synonyms:
OT-R Otr Oxytocin
Type:
Enzyme Catalytic Domain
Mol. Mass.:
42889.28
Organism:
RAT
Description:
Oxytocin OXTR RAT::P70536
Residue:
388
  
Inhibitor
Name:
BDBM50001325
Synonyms:
4,13-Dibenzyl-16-sec-butyl-3,18,19-trimethyl-3,6,12,15,18,21-hexaaza-tricyclo[19.4.0.0*6,10*]pentacosane-2,5,11,14,17,20-hexaone | CHEMBL339452
Type:
Small organic molecule
Emp. Form.:
C40H54N6O6
Mol. Mass.:
714.8934
SMILES:
CC[C@H](C)[C@@H]1NC(=O)[C@@H](Cc2ccccc2)NC(=O)[C@@H]2CCCN2C(=O)[C@@H](Cc2ccccc2)N(C)C(=O)[C@@H]2CCCCN2C(=O)[C@@H](C)N(C)C1=O
: