Target
Platelet-activating factor receptor
Ligand
BDBM50003518
Substrate
Meas. Tech.
ChEBML_154975
IC50
44000±n/a nM
Citation
 Carceller, EAlmansa, CMerlos, MGiral, MBartrolí, JGarcía-Rafanell, JForn, J (Pyridylcyanomethyl)piperazines as orally active PAF antagonists. J Med Chem 35:4118-34 (1992)  
Target
Name:
Platelet-activating factor receptor
Synonyms:
PAF-R PTAFR_CAVPO Platelet-activating factor receptor
Type:
Protein
Mol. Mass.:
39005.63
Organism:
Cavia porcellus
Description:
Residue:
342
  
Inhibitor
Name:
BDBM50003518
Synonyms:
1-(4-Oxy-4-pyridin-3-ylmethyl-piperazin-1-yl)-2,2-diphenyl-ethanone; hydrate | CHEMBL132665
Type:
Small organic molecule
Emp. Form.:
C24H25N3O2
Mol. Mass.:
387.4742
SMILES:
[O-][N+]1(Cc2cccnc2)CCN(CC1)C(=O)C(c1ccccc1)c1ccccc1
: