Target
Platelet-activating factor receptor
Ligand
BDBM50003533
Substrate
Meas. Tech.
ChEBML_154975
IC50
210000±n/a nM
Citation
 Carceller, EAlmansa, CMerlos, MGiral, MBartrolí, JGarcía-Rafanell, JForn, J (Pyridylcyanomethyl)piperazines as orally active PAF antagonists. J Med Chem 35:4118-34 (1992)  
Target
Name:
Platelet-activating factor receptor
Synonyms:
PAF-R PTAFR_CAVPO Platelet-activating factor receptor
Type:
Protein
Mol. Mass.:
39005.63
Organism:
Cavia porcellus
Description:
Residue:
342
  
Inhibitor
Name:
BDBM50003533
Synonyms:
(4-Dimethylamino-phenyl)-[4-(3,3-diphenyl-propionyl)-piperazin-1-yl]-acetonitrile | CHEMBL132774
Type:
Small organic molecule
Emp. Form.:
C29H32N4O
Mol. Mass.:
452.5906
SMILES:
CN(C)c1ccc(cc1)C(C#N)N1CCN(CC1)C(=O)CC(c1ccccc1)c1ccccc1
: