Target
Adenosine receptor A1
Ligand
BDBM50368449
Substrate
Meas. Tech.
ChEMBL_28979 (CHEMBL640781)
Ki
41±n/a nM
Citation
 Jacobson, KANikodijevic, OJi, XDBerkich, DAEveleth, DDean, RLHiramatsu, KKassell, NFvan Galen, PJLee, KS Synthesis and biological activity of N6-(p-sulfophenyl)alkyl and N6-sulfoalkyl derivatives of adenosine: water-soluble and peripherally selective adenosine agonists. J Med Chem 35:4143-9 (1992)  
Target
Name:
Adenosine receptor A1
Synonyms:
AA1R_RAT ADENOSINE A1 high Adenosine A1 receptor (A1) Adenosine receptors A1 | Adora1
Type:
Protein
Mol. Mass.:
36704.13
Organism:
Rattus norvegicus (rat)
Description:
Residue:
326
  
Inhibitor
Name:
BDBM50368449
Synonyms:
CHEMBL610435
Type:
Small organic molecule
Emp. Form.:
C12H16N5O7S
Mol. Mass.:
374.35
SMILES:
OC[C@H]1OC([C@H](O)[C@@H]1O)n1cnc2c(NCCS([O-])(=O)=O)ncnc12
: